{"text_format":"1","workbook":"xlsx","n_sheets":3,"sheets":["Company disclosures","Datasheet","Standard disclosure text"],"not_rendered":{"charts":0,"images":5,"macros":0,"external_links":0,"defined_names":11,"comments":0,"pivot_tables":0},"unopened":[],"bounds":{"document_bytes":16777216,"sheet_cells":100000,"rows_first":2000,"rows_last":500,"rows_between":2000,"halvings":0,"cell_chars":16384,"cell_head_chars":4096},"cells_cut":0,"cells_raw":0,"read":"whole","date_system":"1900"}

{"sheet":"Company disclosures","index":0,"n_rows":34,"n_cols":3,"rows_kept":34,"cut":false,"hidden":false,"merged":[]}
[]
[null,{"$error":"#VALUE!"}]
[]
[null,null,{"$error":"#VALUE!"}]
[null,null,"Credit Research coverage universe - Nordic"]
[null,null,"Select company name [from drop down menu below]:"]
[null,null,"A. P. Moller - Maersk"]
[null,null,"Last updated 8 July 2025"]
[]
[null,null,"Share holding 1% "]
[null,null,"On the date of this report, Danske Bank A/S , its affiliates and subsidiaries, in the aggregate, beneficially own 1% or more of a class of financial instruments issued by the issuer."]
[null,null,{"$f":"IFERROR(IF(VLOOKUP(C7,Datasheet!B9:C182, 2, FALSE) = \" \", \"n.a.\", VLOOKUP(C7,Datasheet!B9:C182, 2, FALSE)), \"n.a.\")","v":"n.a."}]
[]
[null,null,"Share holding 5% "]
[null,null,"On the date of this report, Danske Bank A/S , its affiliates and subsidiaries, in the aggregate, beneficially own 5% or more of a class of financial instruments issued by the issuer."]
[null,null,{"$f":"IFERROR(IF(VLOOKUP(C7,Datasheet!B9:D182, 3, FALSE) = \" \", \"n.a.\", VLOOKUP(C7,Datasheet!B9:D182, 3, FALSE)), \"n.a.\")","v":"n.a."}]
[]
[null,null,"Long position 0.5% "]
[null,null,"On the date of this report, Danske Bank A/S, its affiliates and subsidiaries, in the aggregate, beneficially owned a net long position exceeding 0.5% of the total issued share capital of the issuer."]
[null,null,{"$f":"IFERROR(IF(VLOOKUP(C7,Datasheet!B9:E182, 4, FALSE) = \" \", \"n.a.\", VLOOKUP(C7,Datasheet!B9:E182, 4, FALSE)), \"n.a.\")","v":"Y"}]
[]
[null,null,"Danske Bank A/S is a market maker and a liquidity provider and may hold positions in the financial instruments of the issuer(s) mentioned in this research report"]
[null,null,"As an investment bank, Danske Bank A/S, its affiliates and subsidiaries provide a variety of financial services, including investment banking services. "]
[null,null,{"$f":"\"It is possible that Danske Bank A/S and/or its affiliates and/or its subsidiaries might seek to become engaged to provide such services to \"&C7&\" in the next three months.\"","v":"It is possible that Danske Bank A/S and/or its affiliates and/or its subsidiaries might seek to become engaged to provide such services to A. P. Moller - Maersk in the next three months."}]
[null,{"$f":"IFERROR(IF(VLOOKUP(C7,Datasheet!B9:F182, 2, FALSE) = \" \", \"n.a.\", VLOOKUP(C7,#REF!, 2, FALSE)), \"n.a.\")","v":"n.a."},{"$f":"\"Danske Bank A/S has made no agreement with \" & C7 & \" to write this research report. No parts of this research report have been disclosed to \" & C7 & \". No recommendations or opinions have been disclosed to \" & C7 & \" and no amendments have accordingly been made to the same before dissemination of the research report.\"","v":"Danske Bank A/S has made no agreement with A. P. Moller - Maersk to write this research report. No parts of this research report have been disclosed to A. P. Moller - Maersk. No recommendations or opinions have been disclosed to A. P. Moller - Maersk and no amendments have accordingly been made to the same before dissemination of the research report."}]
[]
[null,null,"Manager text"]
[null,null,{"$f":"IF(ISBLANK($C$7),\"\",IFERROR(IF(VLOOKUP($C$7,Datasheet!B9:F255,5,FALSE)=\" \",\"n.a\",VLOOKUP($C$7,Datasheet!B9:F255,5,FALSE)),\"n.a\"))","v":"Within the previous 12 months, Danske Bank has acted as Financial advisor (to buyer) of a public offer of M&A (acquisition of Concentric AB) for A.P. Møller Holding A/S, has acted as Financial Advisor to APMH in connection with the offering purchase of all shares (Public to Private) in Svitzer Group and has acted as Financial Adviser to APMM in the demerger and separate listing of Svitzer Group A/S."}]
[]
[null,null,"Relations may conflict"]
[null,null,{"$f":"IF(ISBLANK($C$7),\"\",IFERROR(IF(VLOOKUP($C$7,Datasheet!B9:G255, 6, FALSE) = \" \", \"n.a\", VLOOKUP($C$7,Datasheet!B9:G255, 6, FALSE)),\"n.a\"))","v":"n.a"}]
[]
[null,null,"Relations conflict"]
[null,null,{"$f":"IF(ISBLANK($C$7),\"\",IFERROR(IF(VLOOKUP($C$7,Datasheet!B9:H255, 7, FALSE)=\" \",\"n.a\",VLOOKUP($C$7,Datasheet!B9:H255, 7, FALSE)),\"n.a\"))","v":"A representative of A.P. Møller Holding currently serves as the Vice Chairman of the Board of Directors of Danske Bank A/S, having been elected by the Annual General Meeting in 2024. A.P. Møller Holding owns in excess of 20% of Danske Bank shares, "}]

{"sheet":"Datasheet","index":1,"n_rows":189,"n_cols":8,"rows_kept":189,"cut":false,"hidden":true,"merged":[]}
["XLM","08/07/2025"]
[null,"181,6,503,standard\\Minibase,1,A70283,2,350,1,-1,,1,1,1,-1,,0D,0,0,10,0,0,1,0,0,v6.9.21.2x64(2022,08/07/2025,MINIBASE,","f@","f@","f@","f@","f@","f@"]
[null,"currency=EUR,frq=D,tseries=PPRICE"]
[null,null,"STATUS\\CRE_DISC_KEY_01","STATUS\\CRE_DISC_KEY_02","STATUS\\CRE_DISC_KEY_09","STATUS\\CRE_DISC_KEY_04_TEXT","STATUS\\CRE_DISC_KEY_07_REL","STATUS\\CRE_DISC_KEY_08_REL"]
[null,"Minibase All Active - DCM in EUR as of 08/07/25 - FICC_LIVE"]
["HM"]
[]
[" ","Name","Share holding 1% (Y/N)","Share holding 5% (Y/N)","Long position 0.5% (Y/N)","Manager text","Relations may conflict","Relations conflict"]
["C01000","A. P. Moller - Maersk"," "," ","Y","Within the previous 12 months, Danske Bank has acted as Financial advisor (to buyer) of a public offer of M&A (acquisition of Concentric AB) for A.P. Møller Holding A/S, has acted as Financial Advisor to APMH in connection with the offering purchase of all shares (Public to Private) in Svitzer Group and has acted as Financial Adviser to APMM in the demerger and separate listing of Svitzer Group A/S."," ","A representative of A.P. Møller Holding currently serves as the Vice Chairman of the Board of Directors of Danske Bank A/S, having been elected by the Annual General Meeting in 2024. A.P. Møller Holding owns in excess of 20% of Danske Bank shares, "]
["C02069","Ahlstrom Holding 3 Oy "," "," "," "," "," "," "]
["C02071","Akelius Residential AB"," "," "," "," "," "," "]
["C70076","Aker"," "," "," ","Within the previous 12 months, Danske Bank has acted as Joint Bookrunner of a public offer of credit bonds for Aker ASA and as Joint Lead Bookrunner of a public offer of senior unsecured green bond for Aker Horizons ASA."," "," "]
["C60170","Aktia Bank plc"," "," "," ","Within the previous 12 months, Danske Bank has acted as Sole Lead Manager of a public offer of credit bonds for Aktia Bank plc  and as Joint Lead Manager of a public offer of credit bonds for Aktia Bank Plc."," "," "]
["C60538","Arion Bank"," "," "," "," "," "," "]
["C70055","Arjo"," "," "," ","Within the previous 12 months, Danske Bank has acted as Joint Lead Manager of a public offer of credit bonds for Arjo AB."," "," "]
["C02073","Arla Foods"," "," "," "," "," "," "]
["C70750","Arwidsro Fastighets AB"," "," "," ","Within the previous 12 months, Danske Bank has acted as Joint Lead Manager of a public offer of credit bonds for Arwidsro Fastighets AB and as Sole Bookrunner of a public offer of credit bonds for Arwidsro Fastighets AB."," "," "]
["C01020","Assa Abloy"," "," "," ","Within the previous 12 months, Danske Bank has as Sole Lead Manager of a public offer of credit bonds for Assa Abloy AB."," "," "]
["C01026","Atlas Copco"," "," "," ","Within the previous 12 months, Danske Bank has acted as Joint Lead Manager of a public offer of credit bonds for Atlas Copco Finance. "," "," "]
["C02075","Avinor AS"," "," "," "," "," "," "]
["C01648","Balder"," "," "," ","Within the previous 12 months, Danske Bank has acted as Sole Lead Manager of a public offer of credit bonds for Fastighets AB Balder, as Joint Lead Manager of a public offer of credit bonds for Fastighets AB Balder and has acted as Joint Bookrunner of a public offer of credit bonds for Fastighets AB Balder."," "," "]
["C70107","Bane NOR Eiendom"," "," "," ","Within the previous 12 months, Danske Bank has acted as Sole Lead Manager of a public offer of credit bonds for Bane NOR Eiendom AS."," "," "]
["C01652","Boliden"," "," "," "," "," "," "]
["C01052","BW Offshore"," "," "," "," "," "," "]
["C01058","Carlsberg"," "," "," ","Within the previous 12 months, Danske Bank has acted as Joint Bookrunner of a public offer of credit bonds for Carlsberg Breweries A/S."," "," "]
["C70801","Carucel Property"," "," "," ","Within the previous 12 months, Danske Bank has acted as Joint Lead Manager of a public offer of High Yield bonds for Carucel Property"," "," "]
["C01412","Castellum"," "," "," ","Within the previous 12 months, Danske Bank has acted as Joint Lead Manager of a public offer of credit bonds for Castellum AB."," "," "]
["C70365","Cibus"," "," "," ","Within the previous 12 months, Danske Bank has acted as Joint Bookrunner in connection with the Directed Share Issue for Cibus Nordic Real Estate AB ."," "," "]
["C01064","Citycon"," "," "," ","Within the previous 12 months, Danske Bank has acted as Joint Bookrunner of a public offer of credit bonds for Citycon Treasury B.V,  as Dealer Managers for the tender offer for the outstanding notes of Citycon Treasury B.V. for Citycon Oyj and  as Joint Lead Manager of a public offer of credit bonds for Citycon Treasury B.V."," "," "]
["C01068","Coloplast"," "," "," "," "," "," "]
["C02087","Color Group AS"," "," "," ","Within the previous 12 months, Danske Bank has acted as Joint Lead Manager of a public offer of credit bonds for Color Group AS."," "," "]
["C60304","Crayon Group","Y"," "," "," "," "," "]
["C02091","Danfoss A/S"," "," "," "," "," "," "]
["C01084","DFDS"," "," "," "," "," "," "]
["C70560","Diös Fastigheter"," "," "," ","Within the previous 12 months, Danske Bank has acted as Joint Lead Manager of a public offer of credit bonds for Dios Fastigheter and  has acted as Sole Lead Manager of a public offer of credit bonds for Diös Fastigheter AB.\r\r\r\r\r\r\r\r\r\r\r\r\r\r\r\r\n"," "," "]
["C60492","DLR Kredit A/S"," "," "," ","Within the previous 12 months, Danske Bank has acted as Joint Lead Manager of a public offer of credit bonds for DLR Kredit A/S."," "," "]
["C01086","DNB"," "," "," ","Within the previous 12 months, Danske Bank has acted as Joint Lead Manager of a public offer of covered bonds for DNB Boligkreditt, as Joint Lead Manager of a public offer of credit bonds for DNB Boligkreditt and as Sole Lead Manager of a public offer of covered bonds for DNB Boligkreditt."," "," "]
["C70768","DSB"," "," "," "," "," "," "]
["C01088","DSV"," "," "," ","Within the previous 12 months, Danske Bank has acted as Joint Bookrunner of a public offer of credit bonds for DSV Finance B.V and as part of the syndicated banks financing DSV A/S acquisition of Schenker AG."," "," "]
["C01094","Electrolux"," "," "," "," "," "," "]
{"$rows_left_out":150}
{"sheet":"Standard disclosure text","index":2,"n_rows":59,"n_cols":1,"rows_kept":59,"cut":false,"hidden":false,"merged":[]}
["Standard disclosure text used in credit research reports"]
["Disclosures "]
["This research report has been prepared by Credit Research, a division of Danske Bank A/S (‘Danske Bank’)."]
["Analyst certification"]
["Each research analyst responsible for the content of this research report certifies that the views expressed in the research report accurately reflect the research analyst’s personal view about the financial instruments and issuers covered by the research report. Each responsible research analyst further certifies that no part of the compensation of the research analyst was, is or will be, directly or indirectly, related to the specific recommendations expressed in the research report."]
["Regulation"]
["Danske Bank is authorised and regulated by the Danish Financial Services Authority (Finanstilsynet). Danske Bank is authorised by the Prudential Regulation Authority in the UK and subject to regulation by the Financial Conduct Authority and limited regulation by the Prudential Regulation Authority. Details about the extent of our regulation by the Prudential Regulation Authority are available from us on request."]
["Danske Bank’s research reports are prepared in accordance with the recommendations of Capital Market Denmark."]
["Danske Bank is not registered as a Credit Rating Agency pursuant to the CRA Regulation (Regulation (EC) no. 1060/2009), hence Danske Bank does not comply with, or seek to comply with, the requirements applicable to Credit Rating Agencies."]
["Conflicts of interest"]
["Danske Bank has established procedures to prevent conflicts of interest and to ensure the provision of high-quality research based on research objectivity and independence. These procedures are documented in Danske Bank’s research policies. Employees within Danske Bank’s Research Departments have been instructed that any request that might impair the objectivity and independence of research shall be referred to Research Management and the Compliance Department. Danske Bank’s Research Departments are physically separated from other business areas within Danske Bank and surrounded by arrangements (Chinese Walls) to restrict the flows of sensitive information."]
["Research analysts are remunerated in part based on the overall profitability of Danske Bank, which includes investment banking revenues, but do not receive bonuses or other remuneration linked to specific corporate finance or debt capital transactions."]
["Danske Bank, its affiliates, subsidiaries and staff may perform services for or solicit business from [CompanyName] and may hold long or short positions in, or otherwise be interested in, the financial instruments mentioned in this research report. The Equity and Corporate Bonds analysts of Danske Bank and persons in other departments of Danske Bank with which the relevant analysts have close links are not permitted to invest in 1) financial instruments that are covered by the relevant Equity or Corporate Bonds analyst and 2) the research sector within the geographical area (the Nordics) to which the analyst is linked."]
["Danske Bank, its affiliates and subsidiaries are engaged in commercial banking, securities underwriting, dealing, trading, brokerage, investment management, investment banking, custody and other financial services activities, may be a lender to [CompanyName] and have whatever rights as are available to a creditor under applicable law and the applicable loan and credit agreements. At any time, Danske Bank, its affiliates and subsidiaries may have credit or other information regarding [CompanyName] that is not available to or may not be used by the personnel responsible for the preparation of this report, which might affect the analysis and opinions expressed in this research report."]
["Find individual company disclosures from 'Company disclosures' tab"]
["Risk warning"]
["Major risks connected with recommendations or opinions in this research report, including a sensitivity analysis of relevant assumptions, are stated throughout the text."]
["Expected updates"]
["Post-results: This research report will be updated on a quarterly basis following the quarterly results statement from [CompanyName]."]
["Scandi Handbook and Scandi High-Yield Handbook. These research reports contain updates on selected companies and are published annually, usually in April."]
["Completion and first dissemination"]
["The completion date and time in this research report mean the date and time when the author hands over the final version of the research report to Danske Bank’s editing function for legal review and editing."]
["The date and time of first dissemination mean the date and estimated time of the first dissemination of this research report. The estimated time may deviate up to 15 minutes from the effective dissemination time due to technical limitations."]
["See the back page of this research report for the date and time of first dissemination."]
["Financial models, valuation and/or methodology used in this research report"]
["Calculations and presentations in this research report are based on standard econometric tools and methodology as well as publicly available statistics for each individual security, issuer and/or country."]
["We base our bond valuation conclusion on an estimation of a fair business and financial risk profile of the issuing entity. By combining these risk profiles with market technical and bond-specific issues such as documentation and structuring, we arrive at an overall bond risk profile. We compare the bond spread to those of peers with similar risk profiles and against this background we estimate whether the bond is attractively priced in the market. We express this view with either an Overweight, Marketweight or Underweight recommendation. This signals our opinion of the bond’s performance potential compared with relevant peers in the coming six months."]
["More information about the valuation and/or methodology and the underlying assumptions is accessible via http://www.danskebank.com/en-uk/ci/products-services/markets/research/pages/researchdisclaimer.aspx. Select Credit Research Methodology."]
["Recommendation structure"]
["Investment recommendations are based on the expected development in the credit profile as well as relative value compared with the sector and peers."]
["As at 31 December 2024, Danske Bank Credit Research had investment recommendations on 171 corporate bond issuers. The distribution of recommendations is represented in the distribution of recommendations column below. The proportion of issuers corresponding to each of the recommendation categories above to which Danske Bank provided investment banking services in the previous 12 months ending 31 December 2024 is shown below."]
[]
[]
[]
[]
[]
[]
["Validity time period"]
["This communication and the communications in the list referred to below are valid until the earlier of (a) dissemination of a superseding communication by the author, or (b) significant changes in circumstances following its dissemination, including events relating to the market or the issuer, which can influence the price of the issuer or financial instrument."]
["Investment recommendations disseminated in the preceding 12-month period"]
{"$rows_left_out":19}