{"text_format":"1","workbook":"xlsx","n_sheets":5,"sheets":["Company disclosures","Datasheet","Equity Research disc text","Commissioned Research disc text","Danske Bank self research disc"],"not_rendered":{"charts":0,"images":4,"macros":0,"external_links":0,"defined_names":14,"comments":0,"pivot_tables":0},"unopened":[],"bounds":{"document_bytes":16777216,"sheet_cells":100000,"rows_first":2000,"rows_last":500,"rows_between":2000,"halvings":0,"cell_chars":16384,"cell_head_chars":4096},"cells_cut":0,"cells_raw":0,"read":"whole","date_system":"1900"}

{"sheet":"Company disclosures","index":0,"n_rows":64,"n_cols":5,"rows_kept":64,"cut":false,"hidden":false,"merged":[]}
[]
[null,{"$error":"#VALUE!"}]
[]
[null,null,{"$error":"#VALUE!"}]
[null,null,"Equity Research coverage universe"]
[null,null,"Select company name [from drop down menu below]:"]
[null,null,"A. P. Moller - Maersk"]
[null,null,"Last updated 16 June 2025"]
[null,null,"Share holding 1% "]
[null,null,"On the date of this report, Danske Bank A/S , its affiliates and subsidiaries, in the aggregate, beneficially own 1% or more of a class of financial instruments issued by the issuer."]
[null,null,{"$f":"IFERROR(IF(VLOOKUP(C7, Datasheet!B9:C311, 2, FALSE) = \" \", \"n.a.\", VLOOKUP(C7, Datasheet!B9:C311, 2, FALSE)), \"n.a.\")","v":"n.a."}]
[]
[null,null,"Share holding 5% "]
[null,null,"On the date of this report, Danske Bank A/S , its affiliates and subsidiaries, in the aggregate, beneficially own 5% or more of a class of financial instruments issued by the issuer."]
[null,null,{"$f":"IFERROR(IF(VLOOKUP(C7, Datasheet!B9:D311, 3, FALSE) = \" \", \"n.a.\", VLOOKUP(C7, Datasheet!B9:D311, 3, FALSE)), \"n.a.\")","v":"n.a."}]
[]
[null,null,"Long position 0.5% "]
[null,null,"On the date of this report, Danske Bank A/S, its affiliates and subsidiaries, in the aggregate, beneficially owned a net long position exceeding 0.5% of the total issued share capital of the issuer."]
[null,null,{"$f":"IFERROR(IF(VLOOKUP(C7, Datasheet!B9:E311, 4, FALSE) = \" \", \"n.a.\", VLOOKUP(C7, Datasheet!B9:E311, 4, FALSE)), \"n.a.\")","v":"Y"}]
[]
{"$rows_left_out":45}
{"sheet":"Datasheet","index":1,"n_rows":267,"n_cols":8,"rows_kept":267,"cut":false,"hidden":true,"merged":[]}
["XLM","17/06/2025"]
[null,"259,6,503,standard\\Minibase,1,A01430,2,350,1,-1,,1,1,1,-1,,0D,0,0,10,0,0,1,0,0,v6.9.21.2x64(2022,17/06/2025,MINIBASE,","f@","f@","f@","f@","f@","f@"]
[null,"currency=EUR,frq=D,tseries=PPRICE"]
[null,null,"STATUS\\DISC_KEY_01","STATUS\\DISC_KEY_02","STATUS\\DISC_KEY_09","STATUS\\DISC_KEY_04_TEXT","STATUS\\DISC_KEY_07_REL","STATUS\\DISC_KEY_08_REL"]
[null,"Minibase All Active - EQ in EUR as of 17/06/25 - LDS"]
["HM"]
[]
[" ","Name","Share holding 1% (Y/N)","Share holding 5% (Y/N)","Long position 0.5% (Y/N)","Manager text","Relations may conflict","Relations conflict"]
["C01000","A. P. Moller - Maersk"," "," ","Y","Within the previous 12 months, Danske Bank has acted as Financial Adviser to APMM in the demerger and separate listing of Svitzer Group A/S and has acted as Financial advisor (to buyer) of a public offer of M&A (acquisition of Concentric AB) for A.P. Møller Holding A/S.  Danske Bank is acting as Financial Advisor to APMH in connection with the offering puchase of all shares (Public to Private) in Svitzer Group.","On the date of the latest calculation, [add date], A.P. Møller Holding owns in excess of 20% of Danske Bank shares. ","A representative of A.P. Møller Holding currently serves on the Board of Directors of Danske Bank A/S and has held a position on the Board since 7 December 2018."]
["C01408","AAK"," "," "," "," "," "," "]
["C01002","ABB"," "," "," "," "," "," "]
["C01771","Addtech"," "," "," "," "," "," "]
["C70435","Admicom","Y"," "," "," "," "," "]
["C01268","AFRY"," "," "," "," "," "," "]
["C70076","Aker"," "," "," ","Within the previous 12 months, Danske Bank has acted as Joint Bookrunner of a public offer of credit bonds for Aker ASA and has acted as Joint Lead Bookrunner of a public offer of senior unsecured green bond for Aker Horizons ASA."," "," "]
["C01082","Aker BP","Y"," "," ","Within the previous 12 months, Danske Bank has acted as Joint Bookrunner of a public offer of credit bonds for Aker ASA and has acted as Joint Lead Bookrunner of a public offer of senior unsecured green bond for Aker Horizons ASA."," "," "]
["C70554","Aker Horizons","Y"," "," ","Within the previous 12 months, Danske Bank has acted as Joint Bookrunner of a public offer of credit bonds for Aker ASA and has acted as Joint Lead Bookrunner of a public offer of senior unsecured green bond for Aker Horizons ASA."," "," "]
["C01006","Aker Solutions"," "," "," ","Within the previous 12 months, Danske Bank has acted as Joint Bookrunner of a public offer of credit bonds for Aker ASA and has acted as Joint Lead Bookrunner of a public offer of senior unsecured green bond for Aker Horizons ASA."," "," "]
["C01008","Alfa Laval"," "," "," "," "," "," "]
["C70687","Alleima"," "," "," "," "," "," "]
{"$rows_left_out":248}
{"sheet":"Equity Research disc text","index":2,"n_rows":60,"n_cols":1,"rows_kept":60,"cut":false,"hidden":false,"merged":[]}
["Standard disclosure text used in equity research reports"]
["Disclosures "]
["This research report has been prepared by Equity Research, a division of Danske Bank A/S (‘Danske Bank’). The author of this research report is [Analyst(s)]."]
["Analyst certification"]
["Each research analyst responsible for the content of this research report certifies that the views expressed in the research report accurately reflect the research analyst’s personal view about the financial instruments and issuers covered by the research report. Each responsible research analyst further certifies that no part of the compensation of the research analyst was, is or will be, directly or indirectly, related to the specific recommendations expressed in the research report."]
["Regulation"]
["Danske Bank is authorised and regulated by the Danish Financial Services Authority (Finanstilsynet). Danske Bank is authorised by the Prudential Regulation Authority in the UK and subject to regulation by the Financial Conduct Authority and limited regulation by the Prudential Regulation Authority. Details about the extent of our regulation by the Prudential Regulation Authority are available from us on request."]
["Danske Bank’s research reports are prepared in accordance with the recommendations of the Danish Securities Dealers Association."]
["Conflicts of interest"]
["Danske Bank has established procedures to prevent conflicts of interest and to ensure the provision of high-quality research based on research objectivity and independence. These procedures are documented in Danske Bank’s research policies. Employees within Danske Bank’s Research Departments have been instructed that any request that might impair the objectivity and independence of research shall be referred to Research Management and the Compliance Department. Danske Bank’s Research Departments are physically separated from other business areas within Danske Bank and surrounded by arrangements (Chinese Walls) to restrict the flows of sensitive information."]
["Research analysts are remunerated in part based on the overall profitability of Danske Bank, which includes investment banking revenues, but do not receive bonuses or other remuneration linked to specific corporate finance or debt capital transactions."]
["Danske Bank, its affiliates, subsidiaries and staff may perform services for or solicit business from [CompanyName] and may hold long or short positions in, or otherwise be interested in, the financial instruments mentioned in this research report. The Equity and Corporate Bonds analysts of Danske Bank and persons in other departments of Danske Bank with which the relevant analysts have close links are not permitted to invest in 1) financial instruments that are covered by the relevant Equity or Corporate Bonds analyst and 2) the research sector within the geographical area (the Nordics) to which the analyst is linked."]
["Danske Bank, its affiliates and subsidiaries are engaged in commercial banking, securities underwriting, dealing, trading, brokerage, investment management, investment banking, custody and other financial services activities, may be a lender to [CompanyName] and have whatever rights as are available to a creditor under applicable law and the applicable loan and credit agreements. At any time, Danske Bank, its affiliates and subsidiaries may have credit or other information regarding [CompanyName] that is not available to or may not be used by the personnel responsible for the preparation of this report, which might affect the analysis and opinions expressed in this research report."]
["Find individual company disclosures from 'Company disclosures' tab"]
["Financial models and/or methodology used in this research report"]
["Recommendations and opinions in this research report are formed on the basis of a combined selection of discounted cash flow analysis, industry knowledge, peer group analysis and company-specific and market technical elements (events affecting both the financial and operational profile of the company). Forecasting of company sales and earnings is based on segmented bottom-up models using subjective views of relevant future market developments. In addition, the expected macroeconomic environment is taken into account. The output is aggregated into models for group profit and loss, balance sheets and cash flow estimates – all taking into account the recent development in historical research reports."]
["More information about the valuation and/or methodology and the underlying assumptions is accessible via www.danskebank.com/equityresearch."]
["Risk warning"]
["Major risks connected with recommendations or opinions in this research report, including a sensitivity analysis of relevant assumptions, are stated throughout the text."]
["Expected updates"]
{"$rows_left_out":41}
{"sheet":"Commissioned Research disc text","index":3,"n_rows":45,"n_cols":3,"rows_kept":45,"cut":false,"hidden":false,"merged":[[4,2,14,2]]}
["Standard disclosure text used in commssioned research reports"]
["Commissioned Research is NOT FOR DISTRIBUTION INTO THE US"]
["Disclosures",null,"The following companies are part of the"]
["This commissioned research report has been prepared by Equity Research, a division of Danske Bank A/S (‘Danske Bank’). The author of this research report is [analyst name].",null," commissioned research covearge universe:"]
["This commissioned research report should be considered marketing material, as it has been requested and paid for by [COMPANY NAME] and has therefore not been prepared in accordance with the legal requirements designed to promote the independence of investment research. However, the report is still subject to prohibition on dealing ahead of the dissemination of the report.",null,"Bioretec\nExel Composites\nFiskars\nGlaston\nKreate Group\nLamor\nOma Savings Bank\nPharma Equity Group\nPihlajalinna\nRTX\nSparekassen Sjælland-Fyn\nSpinnova\nTalenom\nVerkkokauppa.com"]
["Analyst certification"]
["Each research analyst responsible for the content of this commissioned research report certifies that the views expressed in the research report accurately reflect the research analyst’s personal view about the financial instruments and issuers covered by the research report. "]
["Regulation"]
["Danske Bank is authorised and regulated by the Danish Financial Services Authority (Finanstilsynet). Danske Bank is authorised by the Prudential Regulation Authority in the UK and subject to regulation by the Financial Conduct Authority and limited regulation by the Prudential Regulation Authority. Details about the extent of our regulation by the Prudential Regulation Authority are available from us on request."]
["Danske Bank’s commissioned research reports are prepared in accordance with the recommendations of Capital Market Denmark."]
["Conflicts of interest"]
["Danske Bank has established procedures to prevent conflicts of interest and to ensure the provision of high-quality research based on research objectivity and independence from outside influences. These procedures are documented in Danske Bank’s research policies. Employees within Danske Bank’s Research Departments have been instructed that any request that might impair the objectivity of research and independence from outside influence of research shall be referred to Research Management and the Compliance Department. Danske Bank’s Research Departments are physically separated from other business areas within Danske Bank and surrounded by arrangements (Chinese Walls) to restrict the flows of sensitive information."]
["Research analysts are remunerated in part based on the overall profitability of Danske Bank, which includes investment banking revenues, but do not receive bonuses or other remuneration linked to specific corporate finance or debt capital transactions."]
["Danske Bank, its affiliates, subsidiaries and staff may perform services for or solicit business from [COMPANY NAME] and may hold long or short positions in, or otherwise be interested in, the financial instruments mentioned in this research report. The Equity and Corporate Bonds analysts of Danske Bank and persons in other departments of Danske Bank with which the relevant analysts have close links are not permitted to invest in 1) financial instruments that are covered by the relevant Equity or Corporate Bonds analyst and 2) the research sector within the geographical area (the Nordics) to which the analyst is linked."]
["Danske Bank, its affiliates and subsidiaries are engaged in commercial banking, securities underwriting, dealing, trading, brokerage, investment management, investment banking, custody and other financial services activities, may be a lender to [COMPANY NAME] and have whatever rights as are available to a creditor under applicable law and the applicable loan and credit agreements. At any time, Danske Bank, its affiliates and subsidiaries may have credit or other information regarding [COMPANY NAME] that is not available to or may not be used by the personnel responsible for the preparation of this report, which might affect the analysis and opinions expressed in this research report."]
["Find individual company disclosures from 'Company disclosures' tab"]
["Danske Bank is a market maker and a liquidity provider and may hold positions in the financial instruments of the issuer(s) mentioned in this research report."]
["Parts/No Parts of this research report have been disclosed to [COMPANY NAME] for factual check."]
["As an investment bank, Danske Bank, its affiliates and subsidiaries provide a variety of financial services, including investment banking services. It is possible that Danske Bank and/or its affiliates and/or its subsidiaries might seek to become engaged to provide such services to [COMPANY NAME] in the next three months."]
["Financial models and/or methodology used in this research report"]
{"$rows_left_out":26}
{"sheet":"Danske Bank self research disc","index":4,"n_rows":56,"n_cols":1,"rows_kept":56,"cut":false,"hidden":false,"merged":[]}
["Standard disclosure and disclaimer text used in Danske Bank self research reports"]
["Danske Bank self research: MAY NOT BE DISTRIBUTED IN THE UNITED STATES, CANADA OR SINGAPORE"]
["We do not  have recommendation or target price for Danske Bank self research."]
["Each research analyst responsible for the content of this research report certifies that the views expressed in the research report accurately reflect the research analyst’s personal view about the financial instruments and issuers covered by the research report. Each responsible research analyst further certifies that no part of the compensation of the research analyst was, is or will be, directly or indirectly, related to the specific recommendations expressed in the research report."]
["Regulation"]
["Danske Bank A/S is authorised and regulated by the Danish Financial Services Authority (Finanstilsynet). Danske Bank A/S is authorised by the Prudential Regulation Authority in the UK and subject to regulation by the Financial Conduct Authority and limited regulation by the Prudential Regulation Authority. Details about the extent of our regulation by the Prudential Regulation Authority are available from us on request."]
["Danske Bank’s research reports are prepared in accordance with the recommendations of Capital Market Denmark."]
["Conflicts of interest"]
["Danske Bank A/S has established procedures to prevent conflicts of interest and to ensure the provision of high-quality research based on research objectivity and independence. These procedures are documented in Danske Bank’s research policies. Employees within Danske Bank’s Research Departments have been instructed that any request that might impair the objectivity and independence of research shall be referred to Research Management and the Compliance Department. Danske Bank’s Research Departments are physically separated from other business areas within Danske Bank A/S and surrounded by arrangements (Information Barriers) to restrict the flow of sensitive information."]
["Research analysts are remunerated in part based on the overall profitability of Danske Bank A/S, which includes investment banking revenues, but do not receive bonuses or other remuneration linked to specific corporate finance or equity/debt capital transactions."]
["Danske Bank A/S, its affiliates, subsidiaries and staff may perform services for or solicit business on behalf of Danske Bank A/S and may hold long or short positions in, or otherwise be interested in, the financial instruments mentioned in this research report. The analyst of Equity Research and persons in other departments of Danske Bank A/S with which the relevant analysts have close links are not permitted to invest in 1) financial instruments that are covered by the relevant Equity Research analyst and 2) the research sector within the geographical area (the Nordics) to which the Equity Research analyst is linked."]
["Danske Bank A/S, its affiliates and subsidiaries are engaged in commercial banking, securities underwriting, dealing, trading, brokerage, investment management, investment banking, custody and other financial activities and have whatever rights as are available to a creditor or debtor under applicable law and the applicable loan and credit agreements. At any time, Danske Bank A/S’ affiliates, subsidiaries, departments and staff members may have credit or other information regarding Danske Bank A/S that is not available to or may not be used by the personnel responsible for the preparation of this report, which might affect the analysis and opinions expressed in this research report."]
["Find specific company disclosures from 'Company disclosures' tab"]
["Danske Bank A/S is a market maker and a liquidity provider and may hold positions in the financial instruments of the issuer(s) mentioned in this research report."]
["No parts of this research report, no opinions or recommendations have been disclosed to other business departments or staff members outside Equity Research within Danske Bank A/S except for the Compliance Department, and no amendments have accordingly been made to the same before dissemination of the research report."]
["Financial models and/or methodology used in this research report"]
["Recommendations and opinions in this research report are formed on the basis of a combined selection of discounted cash flow analysis, industry knowledge, peer group analysis and company-specific and market technical elements (events affecting both the financial and operational profile of the company). Forecasting of company sales and earnings is based on segmented bottom-up models using subjective views of relevant future market developments. In addition, the expected macroeconomic environment is taken into account. The output is aggregated into models for group profit and loss, balance sheets and cash flow estimates – all taking into account the recent development in historical research reports."]
["More information about the valuation and/or methodology and the underlying assumptions is accessible via www.danskebank.com/equityresearch."]
["Risk warning"]
["Major risks connected with recommendations or opinions in this research report, including a sensitivity analysis of relevant assumptions, are stated throughout the text."]
{"$rows_left_out":36}